Target
Dual specificity protein kinase TTK
Ligand
BDBM532295
Substrate
Meas. Tech.
TTK Enzyme Assay
IC50
0.980±n/a nM
Citation
 De Roos, JUitdehaag, JCDe Man, APBuijsman, RCZaman, GJ Prognostic biomarkers for TTK inhibitor chemotherapy US Patent  US11208696 Publication Date 12/28/2021 
Target
Name:
Dual specificity protein kinase TTK
Synonyms:
Dual specificity protein kinase (TTK) MPS1 Monopolar Spindle 1 (MPS1) Monopolar Spindle 1 Kinase (MPS1) TTK | TTK_HUMAN
Type:
Protein
Mol. Mass.:
97086.79
Organism:
Homo sapiens (Human)
Description:
P33981
Residue:
857
  
Inhibitor
Name:
BDBM532295
Synonyms:
JDM0466A US11208696, Example 14
Type:
Small organic molecule
Emp. Form.:
C35H47N9O4
Mol. Mass.:
657.8056
SMILES:
CCc1nn(CCOCCOC)c(CC)c1NC(=O)c1ccn-2c1CCc1cnc(Nc3ccc(cc3OC)N3CCN(C)CC3)nc-21
: