Target
Dual specificity protein kinase TTK
Ligand
BDBM532303
Substrate
Meas. Tech.
TTK Enzyme Assay
IC50
0.710±n/a nM
Citation
 De Roos, JUitdehaag, JCDe Man, APBuijsman, RCZaman, GJ Prognostic biomarkers for TTK inhibitor chemotherapy US Patent  US11208696 Publication Date 12/28/2021 
Target
Name:
Dual specificity protein kinase TTK
Synonyms:
Dual specificity protein kinase (TTK) MPS1 Monopolar Spindle 1 (MPS1) Monopolar Spindle 1 Kinase (MPS1) TTK | TTK_HUMAN
Type:
Protein
Mol. Mass.:
97086.79
Organism:
Homo sapiens (Human)
Description:
P33981
Residue:
857
  
Inhibitor
Name:
BDBM532303
Synonyms:
JDM713A US11208696, Example 22
Type:
Small organic molecule
Emp. Form.:
C39H54N10O5
Mol. Mass.:
742.9101
SMILES:
CCNCC(=O)N1CCN(CC1)c1ccc(Nc2ncc3CCc4c(ccn4-c3n2)C(=O)Nc2c(CC)nn(CCOCCOCC)c2CC)c(OC)c1
: