Target
Dual specificity protein kinase TTK
Ligand
BDBM532307
Substrate
Meas. Tech.
TTK Enzyme Assay
IC50
0.660±n/a nM
Citation
 De Roos, JUitdehaag, JCDe Man, APBuijsman, RCZaman, GJ Prognostic biomarkers for TTK inhibitor chemotherapy US Patent  US11208696 Publication Date 12/28/2021 
Target
Name:
Dual specificity protein kinase TTK
Synonyms:
Dual specificity protein kinase (TTK) MPS1 Monopolar Spindle 1 (MPS1) Monopolar Spindle 1 Kinase (MPS1) TTK | TTK_HUMAN
Type:
Protein
Mol. Mass.:
97086.79
Organism:
Homo sapiens (Human)
Description:
P33981
Residue:
857
  
Inhibitor
Name:
BDBM532307
Synonyms:
2-[4-[4-[(2R)-azetidine-2-carbonyl]piperazin-1-yl]-2-methoxy-anilino]-N-[3,5-diethyl-1-[2-(2-methoxyethoxy)ethyl]pyrazol-4-yl]-5,6-dihydropyrimido[4,5-e]indolizine-7-carboxamide US11208696, Example 26
Type:
Small organic molecule
Emp. Form.:
C38H50N10O5
Mol. Mass.:
726.8676
SMILES:
CCc1nn(CCOCCOC)c(CC)c1NC(=O)c1ccn-2c1CCc1cnc(Nc3ccc(cc3OC)N3CCN(CC3)C(=O)[C@H]3CCN3)nc-21
: