Target
Dual specificity protein kinase TTK
Ligand
BDBM50420401
Substrate
Meas. Tech.
TTK Enzyme Assay
IC50
7.00±n/a nM
Citation
 De Roos, JUitdehaag, JCDe Man, APBuijsman, RCZaman, GJ Prognostic biomarkers for TTK inhibitor chemotherapy US Patent  US11208696 Publication Date 12/28/2021 
Target
Name:
Dual specificity protein kinase TTK
Synonyms:
Dual specificity protein kinase (TTK) MPS1 Monopolar Spindle 1 (MPS1) Monopolar Spindle 1 Kinase (MPS1) TTK | TTK_HUMAN
Type:
Protein
Mol. Mass.:
97086.79
Organism:
Homo sapiens (Human)
Description:
P33981
Residue:
857
  
Inhibitor
Name:
BDBM50420401
Synonyms:
CHEMBL2089255 | US11208696, Example 31
Type:
Small organic molecule
Emp. Form.:
C17H20N6O
Mol. Mass.:
324.3803
SMILES:
CC(C)(C)Nc1nc(Nc2ccc(cc2)C(N)=O)cc(N)c1C#N
: