Target
Low molecular weight phosphotyrosine protein phosphatase
Ligand
BDBM533304
Substrate
Meas. Tech.
LMPTP Primary Screening Protocol
IC50
500±n/a nM
Citation
 Bottini, NZou, JGanji, SRStanford, SPinkerton, AChung, TDHedrick, MArdecky, R Inhibitors of low molecular weight protein tyrosine phosphatase and uses thereof US Patent  US11220486 Publication Date 1/11/2022 
Target
Name:
Low molecular weight phosphotyrosine protein phosphatase
Synonyms:
3.1.3.2 ACP1 LMW-PTP LMWPTP PPAC_HUMAN low molecular weight phosphotyrosine protein phosphatase isoform c
Type:
Mol. Mass.:
18042.81
Organism:
Homo sapiens (Human)
Description:
P24666
Residue:
158
  
Inhibitor
Name:
BDBM533304
Synonyms:
US10626094, Example I234 morpholin-4-yl 4-{4-[(3-piperidylpropyl)amino](2- quinolyl)}phenyl ketone
Type:
Small organic molecule
Emp. Form.:
C28H34N4O2
Mol. Mass.:
458.5952
SMILES:
O=C(N1CCOCC1)c1ccc(cc1)-c1cc(NCCCC2CCCNC2)c2ccccc2n1
: