Target
Cyclin-dependent kinase 6/G1/S-specific cyclin-D3
Ligand
BDBM462145
Substrate
Meas. Tech.
Mobility Shift Assay
Ki
2.60±n/a nM
Citation
 Chen, PCho-Schultz, SDeal, JGGallego, GMJalaie, MKania, RSNair, SKNinkovic, SOrr, STPalmer, CL Cyclin dependent kinase inhibitors US Patent  US11220494 Publication Date 1/11/2022 
Target
Name:
Cyclin-dependent kinase 6/G1/S-specific cyclin-D3
Synonyms:
CDK6/CycD3 CDK6/G1/S-specific cyclin D3 Cyclin-dependent kinase 6 | Cyclin-dependent kinase 6/G1/S-specific cyclin D3
Type:
Protein
Mol. Mass.:
Description:
Components:
This complex has 2 components.
Component 1
Name:
Cyclin-dependent kinase 6
Synonyms:
CDK6 CDKN6 Cyclin-dependent kinase 6 (CDK 6) | Serine/threonine-protein kinase PLSTIRE
Type:
Enzyme Subunit
Mol. Mass.:
36937.42
Organism:
Homo sapiens (Human)
Description:
Q00534
Residue:
326
  
Component 2
Name:
G1/S-specific cyclin-D3
Synonyms:
CCND3 | CCND3_HUMAN
Type:
Enzyme
Mol. Mass.:
32521.90
Organism:
Homo sapiens (Human)
Description:
P30281
Residue:
292
  
Inhibitor
Name:
BDBM462145
Synonyms:
US10766884, Example A61 | US11220494, Example A61
Type:
Small organic molecule
Emp. Form.:
C22H27ClFN5O3
Mol. Mass.:
463.933
SMILES:
C[C@H](O)c1nc2c(F)cc(cc2n1C(C)(C)C)-c1nc(N[C@@H]2CCOC[C@H]2O)ncc1Cl
: