Target
Cyclin-dependent kinase 6/G1/S-specific cyclin-D3
Ligand
BDBM462209
Substrate
Meas. Tech.
Mobility Shift Assay
Ki
5.10±n/a nM
Citation
 Chen, PCho-Schultz, SDeal, JGGallego, GMJalaie, MKania, RSNair, SKNinkovic, SOrr, STPalmer, CL Cyclin dependent kinase inhibitors US Patent  US11220494 Publication Date 1/11/2022 
Target
Name:
Cyclin-dependent kinase 6/G1/S-specific cyclin-D3
Synonyms:
CDK6/CycD3 CDK6/G1/S-specific cyclin D3 Cyclin-dependent kinase 6 | Cyclin-dependent kinase 6/G1/S-specific cyclin D3
Type:
Protein
Mol. Mass.:
Description:
Components:
This complex has 2 components.
Component 1
Name:
Cyclin-dependent kinase 6
Synonyms:
CDK6 CDKN6 Cyclin-dependent kinase 6 (CDK 6) | Serine/threonine-protein kinase PLSTIRE
Type:
Enzyme Subunit
Mol. Mass.:
36937.42
Organism:
Homo sapiens (Human)
Description:
Q00534
Residue:
326
  
Component 2
Name:
G1/S-specific cyclin-D3
Synonyms:
CCND3 | CCND3_HUMAN
Type:
Enzyme
Mol. Mass.:
32521.90
Organism:
Homo sapiens (Human)
Description:
P30281
Residue:
292
  
Inhibitor
Name:
BDBM462209
Synonyms:
US10766884, Example F27 | US11220494, Example F27
Type:
Small organic molecule
Emp. Form.:
C23H26ClF2N7O2
Mol. Mass.:
505.948
SMILES:
CC(C)n1cnc2c(F)cc(cc12)-c1nc(N[C@@H]2CCN(C[C@H]2O)C(=O)C2(F)CNC2)ncc1Cl
: