Target
Protein kinase C beta type
Ligand
BDBM286380
Substrate
Meas. Tech.
Protein Kinase C beta 2 Assay
Ki
4.24±n/a nM
Citation
 Li, HNukui, SScales, SATeng, MYin, C Substituted n-pyrimidin-4-yl-3-amino-pyrrolo[3,4-c]pyrazoles as protein kinase C inhibitors US Patent  US11220518 Publication Date 1/11/2022 
Target
Name:
Protein kinase C beta type
Synonyms:
KPCB_HUMAN PKC beta PKCB PRKCB1 Protein kinase C beta type | Protein kinase C beta type II (PRKCB2)
Type:
Enzyme
Mol. Mass.:
76873.67
Organism:
Homo sapiens (Human)
Description:
The recombinant human PKC enzymes were produced using a baculovirus expression system in SF9 cells
Residue:
671
  
Inhibitor
Name:
BDBM286380
Synonyms:
N-(4-ethoxypyrimidin-2-yl)-6,6-dimethyl-5-{[(2S,5R)-2,4,5-trimethylpiperazin-1-yl]carbonyl}-1,4,5,6-tetrahydropyrrolo[3,4-c]pyrazol-3-amine US11780853, Example M1 | US9518060, Example M1
Type:
Small organic molecule
Emp. Form.:
C21H32N8O2
Mol. Mass.:
428.5312
SMILES:
CCOc1ccnc(Nc2n[nH]c3c2CN(C(=O)N2C[C@@H](C)N(C)C[C@@H]2C)C3(C)C)n1
: