Target
Receptor-interacting serine/threonine-protein kinase 1
Ligand
BDBM534452
Substrate
Meas. Tech.
RIPK1 HTRF Binding Assay
IC50
0.30±n/a nM
Citation
 Guanglin, LJie, CDiane, DCB., FDJunqing, GC., HAXirui, HE., MMReiser, PMJianliang, SH., SSLee, VBYong-Jin, WZili, XG., YM TRIAZOLOPYRIDINYL COMPOUNDS AS KINASE INHIBITORS WIPO 0:0 (2022) Target
Name:
Receptor-interacting serine/threonine-protein kinase 1
Synonyms:
Cell death protein RIP RIP-1 RIPK1 Receptor-interacting protein 1
Type:
Enzyme Catalytic Domain
Mol. Mass.:
75926.99
Organism:
Homo sapiens (Human)
Description:
Q13546
Residue:
671
  
Inhibitor
Name:
BDBM534452
Synonyms:
WO2022086828, Example 188
Type:
Small organic molecule
Emp. Form.:
C22H15ClF5N5O2
Mol. Mass.:
511.832
SMILES:
Nc1nc2cc(ccn2n1)-c1ccc(Cl)c(C(=O)NCC(F)(F)[C@@H](O)c2cc(F)cc(F)c2)c1F
: