Target
Receptor-interacting serine/threonine-protein kinase 1
Ligand
BDBM534461
Substrate
Meas. Tech.
RIPK1 HTRF Binding Assay
IC50
0.30±n/a nM
Citation
 Guanglin, LJie, CDiane, DCB., FDJunqing, GC., HAXirui, HE., MMReiser, PMJianliang, SH., SSLee, VBYong-Jin, WZili, XG., YM TRIAZOLOPYRIDINYL COMPOUNDS AS KINASE INHIBITORS WIPO 0:0 (2022) Target
Name:
Receptor-interacting serine/threonine-protein kinase 1
Synonyms:
Cell death protein RIP RIP-1 RIPK1 Receptor-interacting protein 1
Type:
Enzyme Catalytic Domain
Mol. Mass.:
75926.99
Organism:
Homo sapiens (Human)
Description:
Q13546
Residue:
671
  
Inhibitor
Name:
BDBM534461
Synonyms:
3 -(2-amino-[1,2,4]triazolo[1,5-α]pyridin-7-yl)-6-(difluoromethyl)-2-fluoro-N-(2-fluoro-3-(4-fluorophenyl)-3-hydroxybutyl-4,4,4-d3)benzamide | WO2022086828, Example 197
Type:
Small organic molecule
Emp. Form.:
C24H20F5N5O2
Mol. Mass.:
505.4399
SMILES:
C[C@](O)([C@H](F)CNC(=O)c1c(F)c(ccc1C(F)F)-c1ccn2nc(N)nc2c1)c1ccc(F)cc1
: