Target
Receptor-interacting serine/threonine-protein kinase 1
Ligand
BDBM534480
Substrate
Meas. Tech.
RIPK1 HTRF Binding Assay
IC50
0.40±n/a nM
Citation
 Guanglin, LJie, CDiane, DCB., FDJunqing, GC., HAXirui, HE., MMReiser, PMJianliang, SH., SSLee, VBYong-Jin, WZili, XG., YM TRIAZOLOPYRIDINYL COMPOUNDS AS KINASE INHIBITORS WIPO 0:0 (2022) Target
Name:
Receptor-interacting serine/threonine-protein kinase 1
Synonyms:
Cell death protein RIP RIP-1 RIPK1 Receptor-interacting protein 1
Type:
Enzyme Catalytic Domain
Mol. Mass.:
75926.99
Organism:
Homo sapiens (Human)
Description:
Q13546
Residue:
671
  
Inhibitor
Name:
BDBM534480
Synonyms:
WO2022086828, Example 216
Type:
Small organic molecule
Emp. Form.:
C24H22F3N5O2
Mol. Mass.:
469.459
SMILES:
Cc1ccc(-c2ccn3nc(N)nc3c2)c(F)c1C(=O)NC[C@@H](F)[C@@](C)(O)c1ccc(F)cc1
: