Target
Plasma kallikrein
Ligand
BDBM416809
Substrate
Meas. Tech.
Plasma Kallikrein Activity Assay
Ki
25.1±n/a nM
Citation
 Kotian, PLBabu, YSWu, MChintareddy, VRKumar, VSZhang, W Human plasma kallikrein inhibitors US Patent  US11230530 Publication Date 1/25/2022 
Target
Name:
Plasma kallikrein
Synonyms:
Fletcher factor KLKB1 Kallikrein Plasma kallikrein heavy chain Plasma prekallikrein
Type:
Protein
Mol. Mass.:
71391.16
Organism:
Homo sapiens (Human)
Description:
P03952
Residue:
638
  
Inhibitor
Name:
BDBM416809
Synonyms:
1-(3-(aminomethyl)phenyl)-N-(3-(2-(cyclopropylamino)-1-hydroxy-1-phenylethyl)phenyl)-3-(trifluoromethyl)-1H-pyrazole-5-carboxamide US10633345, Compound 99g US11203574, Compound 99g US11685721, Compound 99g | US11708332, Compound 99g
Type:
Small organic molecule
Emp. Form.:
C29H28F3N5O2
Mol. Mass.:
535.5601
SMILES:
NCc1cccc(c1)-n1nc(cc1C(=O)Nc1cccc(c1)C(O)(CNC1CC1)c1ccccc1)C(F)(F)F
: