Target
Lysine-specific histone demethylase 1A
Ligand
BDBM194128
Substrate
Meas. Tech.
Biochemical Assay
IC50
<100±n/a nM
Citation
 Wu, LCourter, JRHe, CWang, XYao, WZhang, F Cyclopropylamines as LSD1 inhibitors US Patent  US11247992 Publication Date 2/15/2022 
Target
Name:
Lysine-specific histone demethylase 1A
Synonyms:
AOF2 Flavin-containing amine oxidase domain-containing protein 2 KDM1A KIAA0601 Lysine-specific demethylase 1 (LSD1) Lysine-specific histone demethylase 1 (LSD1)
Type:
Enzyme
Mol. Mass.:
92901.01
Organism:
Homo sapiens (Human)
Description:
O60341
Residue:
852
  
Inhibitor
Name:
BDBM194128
Synonyms:
US10174030, Example 30 US11247992, Example 30 | US9670210, Example 30 Trans-2-phenyl-N-[(1-{[4-(trifluoromethoxy)phenyl]sulfonyl}azetidin-3-yl)methyl]cyclopropanamine
Type:
Small organic molecule
Emp. Form.:
C20H21F3N2O3S
Mol. Mass.:
426.453
SMILES:
FC(F)(F)Oc1ccc(cc1)S(=O)(=O)N1CC(CNC2CC2c2ccccc2)C1
: