Target
Monocarboxylate transporter 4
Ligand
BDBM356895
Substrate
Meas. Tech.
Biological Activity Assay 3
IC50
3.10±n/a nM
Citation
 Parnell, KMMcCall, JRomero, D Heterocyclic inhibitors of MCT4 US Patent  US11292767 Publication Date 4/5/2022 
Target
Name:
Monocarboxylate transporter 4
Synonyms:
MCT 4 MCT4 SLC16A3 | Solute carrier family 16 member 3
Type:
PROTEIN
Mol. Mass.:
49474.36
Organism:
Homo sapiens (Human)
Description:
ChEMBL_104604
Residue:
465
  
Inhibitor
Name:
BDBM356895
Synonyms:
US10214492, Example 246 | US11292767, Example 246
Type:
Small organic molecule
Emp. Form.:
C27H31N5O3
Mol. Mass.:
473.5667
SMILES:
CCCn1ncc2ccc(cc12)-c1cc(COC(C)(C)C(O)=O)nn1-c1ccccc1N1CCC1
: