Target
DNA damage-binding protein 1/Protein cereblon
Ligand
BDBM547708
Substrate
Meas. Tech.
Time-Resolved Fluorescence Resonance Energy Transfer (TR-FRET) Assay
IC50
<10±n/a nM
Citation
 Ji, NKluge, AFWeiss, MMZhang, Y Tricyclic CRBN ligands and uses thereof US Patent  US11292792 Publication Date 4/5/2022 
Target
Name:
DNA damage-binding protein 1/Protein cereblon
Synonyms:
CRBN-DDB1 Cereblon_DDB1 | Protein cereblon/DNA damage-binding protein 1
Type:
Enzyme
Mol. Mass.:
Description:
Components:
This complex has 2 components.
Component 1
Name:
DNA damage-binding protein 1
Synonyms:
DDB p127 subunit DDB1_HUMAN DNA damage-binding protein a HBV X-associated protein 1 UV-damaged DNA-binding factor XAP-1 XPCe XPE-binding factor | Xeroderma pigmentosum group E-complementing protein
Type:
Protein
Mol. Mass.:
126936.22
Organism:
Homo sapiens (Human)
Description:
Q16531
Residue:
1140
  
Component 2
Name:
Protein cereblon
Synonyms:
CRBN | CRBN_HUMAN
Type:
PROTEIN
Mol. Mass.:
50537.73
Organism:
Homo sapiens (Human)
Description:
ChEMBL_116917
Residue:
442
  
Inhibitor
Name:
BDBM547708
Synonyms:
US11292792, CMPD # I-38
Type:
Small organic molecule
Emp. Form.:
C27H33N5O7
Mol. Mass.:
539.5802
SMILES:
CC(C)(C)OC(=O)NCCOCCOC(=O)NCc1ccc2n(C3CCC(=O)NC3=O)c3ncccc3c2c1
: