Target
DNA damage-binding protein 1/Protein cereblon
Ligand
BDBM547767
Substrate
Meas. Tech.
Time-Resolved Fluorescence Resonance Energy Transfer (TR-FRET) Assay
IC50
<10±n/a nM
Citation
 Ji, NKluge, AFWeiss, MMZhang, Y Tricyclic CRBN ligands and uses thereof US Patent  US11292792 Publication Date 4/5/2022 
Target
Name:
DNA damage-binding protein 1/Protein cereblon
Synonyms:
CRBN-DDB1 Cereblon_DDB1 | Protein cereblon/DNA damage-binding protein 1
Type:
Enzyme
Mol. Mass.:
Description:
Components:
This complex has 2 components.
Component 1
Name:
DNA damage-binding protein 1
Synonyms:
DDB p127 subunit DDB1_HUMAN DNA damage-binding protein a HBV X-associated protein 1 UV-damaged DNA-binding factor XAP-1 XPCe XPE-binding factor | Xeroderma pigmentosum group E-complementing protein
Type:
Protein
Mol. Mass.:
126936.22
Organism:
Homo sapiens (Human)
Description:
Q16531
Residue:
1140
  
Component 2
Name:
Protein cereblon
Synonyms:
CRBN | CRBN_HUMAN
Type:
PROTEIN
Mol. Mass.:
50537.73
Organism:
Homo sapiens (Human)
Description:
ChEMBL_116917
Residue:
442
  
Inhibitor
Name:
BDBM547767
Synonyms:
US11292792, CMPD # I-101
Type:
Small organic molecule
Emp. Form.:
C16H12FN3O2
Mol. Mass.:
297.2838
SMILES:
Fc1ccc2c(c1)n(C1CCC(=O)NC1=O)c1ncccc21
: