Target
Tyrosine-protein kinase JAK2
Ligand
BDBM305831
Substrate
Meas. Tech.
JAK Caliper Enzyme Assay at 1 mM ATP
IC50
71.0±n/a nM
Citation
 Brown, MFDermenci, AFensome, AGerstenberger, BSHayward, MMOwen, DRWright, SWXing, LHYang, X Pyrazolo[1,5-A]PYRAZIN-4-YL derivatives US Patent  US10144738 Publication Date 12/4/2018 
Target
Name:
Tyrosine-protein kinase JAK2
Synonyms:
JAK-2 JAK2_HUMAN Janus kinase 2 (JAK2) | Janus kinase 2 (a protein tyrosine kinase)
Type:
Protein
Mol. Mass.:
130684.68
Organism:
Homo sapiens (Human)
Description:
O60674
Residue:
1132
  
Inhibitor
Name:
BDBM305831
Synonyms:
2-((1r,3s)-1-(4-(6-(3-Amino-1H-pyrazol-5-yl)pyrazolo[1,5-a]pyrazin-4-yl)-1H-pyrazol-1-yl)-3-methoxycyclobutyl)acetonitrile US10822341, Example 30 | US11472809, Example 30
Type:
Small organic molecule
Emp. Form.:
C19H19N9O
Mol. Mass.:
389.4139
SMILES:
CO[C@H]1C[C@@](CC#N)(C1)n1cc(cn1)-c1nc(cn2nccc12)-c1cc(N)[nH]n1
: