Target
Lys-gingipain
Ligand
BDBM450998
Substrate
Meas. Tech.
Fluorogenic Assay
IC50
>250±n/a nM
Citation
 Konradi, AWDominy, SSLynch, CCCoburn, CVacca, J Inhibitors of lysine gingipain US Patent  US11332464 Publication Date 5/17/2022 
Target
Name:
Lys-gingipain
Synonyms:
KGP_PORG3 kgp
Type:
Protein
Mol. Mass.:
187217.55
Organism:
Porphyromonas gingivalis
Description:
B2RLK2
Residue:
1723
  
Inhibitor
Name:
BDBM450998
Synonyms:
US10676470, Compound 44 | US11332464, Compound 44
Type:
Small organic molecule
Emp. Form.:
C17H25N3O2
Mol. Mass.:
303.3993
SMILES:
NCCCC[C@H](NC(=O)C1CCCC1)C(=O)c1ccccn1
: