Target
Glycogen synthase kinase-3 beta
Ligand
BDBM8535
Substrate
Biotinylated peptide substrate
Meas. Tech.
Kinase Inhibition SPA Assay
pH
7.2±n/a
Temperature
295.15±n/a K
IC50
6.3±n/a nM
Citation
 Smalley, TLPeat, AJBoucheron, JADickerson, SGarrido, DPreugschat, FSchweiker, SLThomson, SAWang, TY Synthesis and evaluation of novel heterocyclic inhibitors of GSK-3. Bioorg Med Chem Lett 16:2091-4 (2006)  
Target
Name:
Glycogen synthase kinase-3 beta
Synonyms:
GSK-3 beta GSK3B Glycogen synthase kinase 3 beta (GSK3B) Glycogen synthase kinase-3 beta (GSK-3B) Glycogen synthase kinase-3 beta (GSK3B) Glycogen synthase kinase-3beta (GSK3B) | Serine/threonine-protein kinase GSK3B
Type:
Enzyme
Mol. Mass.:
46756.38
Organism:
Homo sapiens (Human)
Description:
P49841
Residue:
420
  
Inhibitor
Name:
BDBM8535
Synonyms:
4-[(1E)-{2-[1-(3-methoxyphenyl)-1H-pyrazolo[3,4-d]pyrimidin-4-yl]hydrazin-1-ylidene}methyl]pyridine | heterocyclic pyrimidyl hydrazone 1
Type:
Small organic molecule
Emp. Form.:
C18H15N7O
Mol. Mass.:
345.358
SMILES:
COc1cccc(c1)-n1ncc2c(N=NCc3ccncc3)ncnc12
:
Substrate
Name:
Biotinylated Peptide Substrate
Synonyms:
Type:
Peptide
Mol. Mass.:
6828.27
Organism:
Description:
Residue:
63