Target
Plasma kallikrein
Ligand
BDBM455292
Substrate
Meas. Tech.
Inhibitory Activity Assay
EC50
<1±n/a nM
Citation
 Papaioannou, NFink, SJMiller, TAShipps, Jr., GWTravins, JMEhmann, DERae, AEllard, JM Inhibitors of plasma kallikrein and uses thereof US Patent  US11352356 Publication Date 6/7/2022 
Target
Name:
Plasma kallikrein
Synonyms:
Fletcher factor KLKB1 Kallikrein Plasma kallikrein heavy chain Plasma prekallikrein
Type:
Protein
Mol. Mass.:
71391.16
Organism:
Homo sapiens (Human)
Description:
P03952
Residue:
638
  
Inhibitor
Name:
BDBM455292
Synonyms:
US10730874, Compound I-300 | US11352356, Compound I-300
Type:
Small organic molecule
Emp. Form.:
C26H24ClF4N9O2
Mol. Mass.:
605.974
SMILES:
OC(CNCc1cc(cn2cc(Cn3cc(nn3)C(=O)NCc3ncn4ccc(Cl)c(F)c34)nc12)C1CC1)C(F)(F)F
: