Target
Plasma kallikrein
Ligand
BDBM306620
Substrate
Meas. Tech.
In Vitro Plasma Kallikrein Inhibition Assay
IC50
1.000±n/a nM
Citation
 Li, ZZancanella, MYu, CSetti, LQSham, HXu, QYee, CWYu, M Bridged bicyclic kallikrein inhibitors US Patent  US10144746 Publication Date 12/4/2018 
Target
Name:
Plasma kallikrein
Synonyms:
Fletcher factor KLKB1 Kallikrein Plasma kallikrein heavy chain Plasma prekallikrein
Type:
Protein
Mol. Mass.:
71391.16
Organism:
Homo sapiens (Human)
Description:
P03952
Residue:
638
  
Inhibitor
Name:
BDBM306620
Synonyms:
(1S,8R)-N-[(4-carbamimidoyl- phenyl)methyl]-12-[(3- chlorophenyl)(methyl)amino]- 15-oxatetracyclo[6.6.1.02,7.09,14] pentadeca-2,4,6,9,11,13- hexaene-4-carboxamide | US10144746, Compound 263
Type:
Small organic molecule
Emp. Form.:
C30H25ClN4O2
Mol. Mass.:
508.998
SMILES:
CN(c1ccc2[C@@H]3O[C@H](c2c1)c1cc(ccc31)C(=O)NCc1ccc(cc1)C(N)=N)c1cccc(Cl)c1
: