Target
Plasma kallikrein
Ligand
BDBM306637
Substrate
Meas. Tech.
In Vitro Plasma Kallikrein Inhibition Assay
IC50
0.759±n/a nM
Citation
 Li, ZZancanella, MYu, CSetti, LQSham, HXu, QYee, CWYu, M Bridged bicyclic kallikrein inhibitors US Patent  US10144746 Publication Date 12/4/2018 
Target
Name:
Plasma kallikrein
Synonyms:
Fletcher factor KLKB1 Kallikrein Plasma kallikrein heavy chain Plasma prekallikrein
Type:
Protein
Mol. Mass.:
71391.16
Organism:
Homo sapiens (Human)
Description:
P03952
Residue:
638
  
Inhibitor
Name:
BDBM306637
Synonyms:
(1R,8S)-N-[(4-carbamimidoyl- 2,6-difluoro-phenyl)methyl]- 12-cyclopropyl-15-oxatetracyclo [6.6.1.02,7.09,14] pentadeca-2,4,6,9,11,13-hexaene- 4-carboxamide | US10144746, Compound 280
Type:
Small organic molecule
Emp. Form.:
C26H21F2N3O2
Mol. Mass.:
445.4606
SMILES:
NC(=N)c1cc(F)c(CNC(=O)c2ccc3[C@H]4O[C@H](c5cc(ccc45)C4CC4)c3c2)c(F)c1
: