Target
Plasma kallikrein
Ligand
BDBM306642
Substrate
Meas. Tech.
In Vitro Plasma Kallikrein Inhibition Assay
IC50
1.000±n/a nM
Citation
 Li, ZZancanella, MYu, CSetti, LQSham, HXu, QYee, CWYu, M Bridged bicyclic kallikrein inhibitors US Patent  US10144746 Publication Date 12/4/2018 
Target
Name:
Plasma kallikrein
Synonyms:
Fletcher factor KLKB1 Kallikrein Plasma kallikrein heavy chain Plasma prekallikrein
Type:
Protein
Mol. Mass.:
71391.16
Organism:
Homo sapiens (Human)
Description:
P03952
Residue:
638
  
Inhibitor
Name:
BDBM306642
Synonyms:
(1R,8S)-N-[(4-carbamimidoyl- 2,6-difluoro-phenyl)methyl]- 12-(prop-1-en-2-yl)-15- oxatetracyclo[6.6.1.02,7.09,14] pentadeca-2,4,6,9,11,l3- hexaene-4-carboxamide | US10144746, Compound 285
Type:
Small organic molecule
Emp. Form.:
C26H21F2N3O2
Mol. Mass.:
445.4606
SMILES:
CC(=C)c1ccc2[C@@H]3O[C@H](c2c1)c1cc(ccc31)C(=O)NCc1c(F)cc(cc1F)C(N)=N
: