Target
Plasma kallikrein
Ligand
BDBM306672
Substrate
Meas. Tech.
In Vitro Plasma Kallikrein Inhibition Assay
IC50
4.90±n/a nM
Citation
 Li, ZZancanella, MYu, CSetti, LQSham, HXu, QYee, CWYu, M Bridged bicyclic kallikrein inhibitors US Patent  US10144746 Publication Date 12/4/2018 
Target
Name:
Plasma kallikrein
Synonyms:
Fletcher factor KLKB1 Kallikrein Plasma kallikrein heavy chain Plasma prekallikrein
Type:
Protein
Mol. Mass.:
71391.16
Organism:
Homo sapiens (Human)
Description:
P03952
Residue:
638
  
Inhibitor
Name:
BDBM306672
Synonyms:
(+-)-N-[(4-carbamimidoyl- phenyl)methyl]-11,12- dicyclopropyl-15-oxatetracyclo [6.6.1.02,7.09,14]-pentadeca- 2,4,6,9,11,13-hexaene-4- carboxamide | US10144746, Compound 316
Type:
Small organic molecule
Emp. Form.:
C29H27N3O2
Mol. Mass.:
449.5436
SMILES:
NC(=N)c1ccc(CNC(=O)c2ccc3C4OC(c3c2)c2cc(C3CC3)c(cc42)C2CC2)cc1
: