Target
Plasma kallikrein
Ligand
BDBM306691
Substrate
Meas. Tech.
In Vitro Plasma Kallikrein Inhibition Assay
IC50
5.01±n/a nM
Citation
 Li, ZZancanella, MYu, CSetti, LQSham, HXu, QYee, CWYu, M Bridged bicyclic kallikrein inhibitors US Patent  US10144746 Publication Date 12/4/2018 
Target
Name:
Plasma kallikrein
Synonyms:
Fletcher factor KLKB1 Kallikrein Plasma kallikrein heavy chain Plasma prekallikrein
Type:
Protein
Mol. Mass.:
71391.16
Organism:
Homo sapiens (Human)
Description:
P03952
Residue:
638
  
Inhibitor
Name:
BDBM306691
Synonyms:
(1S,8R)-N-[(4-carbamimidoyl- 2,6-difluoro-phenyl)methyl]- 12-(1,1-dioxo-1lambda6-thiomorpholin- 4-yl)-15-oxatetracyclo- [6.6.1.02,7.09,14]pentadeca- 2,4,6,9,11,13-hexaene-4- carboxamide | US10144746, Compound 336
Type:
Small organic molecule
Emp. Form.:
C27H24F2N4O4S
Mol. Mass.:
538.566
SMILES:
NC(=N)c1cc(F)c(CNC(=O)c2ccc3[C@H]4O[C@H](c5cc(ccc45)N4CCS(=O)(=O)CC4)c3c2)c(F)c1
: