Target
Apoptosis regulator Bcl-2
Ligand
BDBM189765
Substrate
Meas. Tech.
TBDTR-FRET (Time-Resolved Fluorescence-Resonance-Energy-Transfer) Assay
Ki
0.150±n/a nM
Citation
 Birtalan, EHoelig, PLindley, DJSanzgiri, YDTong, P Melt-extruded solid dispersions containing an apoptosis-inducing agent US Patent  US11369599 Publication Date 6/28/2022 
Target
Name:
Apoptosis regulator Bcl-2
Synonyms:
Apoptosis regulator Bcl-2 Protein BCL-2 BCL2_HUMAN | Bcl-2 Protein
Type:
Homodimer or heterodimer
Mol. Mass.:
26269.11
Organism:
Homo sapiens (Human)
Description:
P10415
Residue:
239
  
Inhibitor
Name:
BDBM189765
Synonyms:
US10213433, Compound 335 US20240043404, Example 335 | US9174982, 335
Type:
Small organic molecule
Emp. Form.:
C46H52Cl2N8O5S
Mol. Mass.:
899.927
SMILES:
CC1(C)CCC(CN2CCN(CC2)c2ccc(C(=O)NS(=O)(=O)c3cnc(NCC4CN(CCO4)C4CC4)c(Cl)c3)c(Oc3cnc4[nH]ccc4c3)c2)=C(C1)c1ccc(Cl)cc1
: