Target
POU domain, class 5, transcription factor 1
Ligand
BDBM50103514
Substrate
Meas. Tech.
OCT3 inhibitory activity
IC50
67600±n/a nM
Citation
 Yamashita, HSuzuki, N OCT3 activity inhibitor containing imidazopyridine derivative as active component, and OCT3 detection agent US Patent  US10149840 Publication Date 12/11/2018 
Target
Name:
POU domain, class 5, transcription factor 1
Synonyms:
OCT3 OTF-3 Oct-3 Octamer-binding protein 3 Octamer-binding transcription factor 3 POU5F1
Type:
Enzyme Catalytic Domain
Mol. Mass.:
38567.64
Organism:
Homo sapiens (Human)
Description:
Q01860
Residue:
360
  
Inhibitor
Name:
BDBM50103514
Synonyms:
CHEBI:4975 Fluxid Pepcid Pepcid Rpd
Type:
Small organic molecule
Emp. Form.:
C8H15N7O2S3
Mol. Mass.:
337.445
SMILES:
NC(=N)Nc1nc(CSCCC(=N)NS(N)(=O)=O)cs1
: