Target
Arginase-1
Ligand
BDBM290421
Substrate
Meas. Tech.
Inhibition of Arginase
IC50
125±n/a nM
Citation
 Van Zandt, MJagdmann, GE Arginase inhibitors as therapeutics US Patent  US11389464 Publication Date 7/19/2022 
Target
Name:
Arginase-1
Synonyms:
ARG1 Liver-type arginase | Type I arginase
Type:
PROTEIN
Mol. Mass.:
34737.53
Organism:
Homo sapiens (Human)
Description:
ChEMBL_978893
Residue:
322
  
Inhibitor
Name:
BDBM290421
Synonyms:
(3R,4S)-3-amino-1-(2-amino-3-phenylpropyl)-4-(3- boronopropyl)pyrrolidine-3-carboxylic acid US10603330, Example 57 | US11389464, Example 57
Type:
Small organic molecule
Emp. Form.:
C17H28BN3O4
Mol. Mass.:
349.233
SMILES:
NC(CN1C[C@H](CCCB(O)O)[C@@](N)(C1)C(O)=O)Cc1ccccc1
: