Target
Genome polyprotein
Ligand
BDBM307535
Substrate
Meas. Tech.
HCV Replicon Luciferase Assay
EC50
6.24±n/a nM
Citation
 Yeung, KKadow, JFBora, ROAnjanappa, PGupta, SV Compounds for the treatment of hepatitis C US Patent  US10150747 Publication Date 12/11/2018 
Target
Name:
Genome polyprotein
Synonyms:
Genome polyprotein RNA polymerase (NS5B)
Type:
Enzyme
Mol. Mass.:
326966.11
Organism:
Hepatitis C virus (HCV)
Description:
Q9WMX2
Residue:
3010
  
Inhibitor
Name:
BDBM307535
Synonyms:
2-(4-Fluorophenyl)-5-(4-methoxy-3-((1-(pyrimidin-2-yl)cyclopropyl)carbamoyl)phenyl)-N-methyl-6-(2,2,2-trifluoroethoxy)benzofuran-3-carboxamide | US10150747, Example 2
Type:
Small organic molecule
Emp. Form.:
C33H26F4N4O5
Mol. Mass.:
634.577
SMILES:
CNC(=O)c1c(oc2cc(OCC(F)(F)F)c(cc12)-c1ccc(OC)c(c1)C(=O)NC1(CC1)c1ncccn1)-c1ccc(F)cc1
: