Target
Mitogen-activated protein kinase 13
Ligand
BDBM563619
Substrate
Meas. Tech.
MAPK13 and MAPK14 enzyme assays
IC50
9.00±n/a nM
Citation
 Holtzman, MJRomero, AGGerovac, BJHan, ZKeeler, SPWu, K Mitogen-activated protein kinase inhibitors, methods of making, and methods of use thereof US Patent  US11407771 Publication Date 8/9/2022 
Target
Name:
Mitogen-activated protein kinase 13
Synonyms:
MAP kinase p38 delta MK13_HUMAN Mitogen-activated protein kinase 13 (MAPK13) Mitogen-activated protein kinase p38 delta SAPK4 p38 delta/gamma
Type:
Enzyme
Mol. Mass.:
42097.16
Organism:
Homo sapiens (Human)
Description:
O15264
Residue:
365
  
Inhibitor
Name:
BDBM563619
Synonyms:
N-[4-[2-[2-[[5-tert-butyl-2-(p- tolyl)pyrazol-3- yl]carbamoylamino]thiazol-5- yl]ethyl]-2-pyridyl]acetamide | US11407771, Compound 282
Type:
Small organic molecule
Emp. Form.:
C27H31N7O2S
Mol. Mass.:
517.646
SMILES:
CC(=O)Nc1cc(CCc2cnc(NC(=O)Nc3cc(nn3-c3ccc(C)cc3)C(C)(C)C)s2)ccn1
: