Target
cAMP and cAMP-inhibited cGMP 3',5'-cyclic phosphodiesterase 10A
Ligand
BDBM97523
Substrate
Meas. Tech.
PDE10A assay
IC50
0.99±n/a nM
Citation
 Tosstorff, ARudolph, MGCole, JCReutlinger, MKramer, CSchaffhauser, HNilly, AFlohr, AKuhn, B A high quality, industrial data set for binding affinity prediction: performance comparison in different early drug discovery scenarios. J Comput Aided Mol Des 36:753-765 (2022)  
Target
Name:
cAMP and cAMP-inhibited cGMP 3',5'-cyclic phosphodiesterase 10A
Synonyms:
3',5'-cyclic phosphodiesterase PDE10A Phosphodiesterase 10 (PDE10) | Phosphodiesterase 10A
Type:
Protein
Mol. Mass.:
88412.52
Organism:
Homo sapiens (Human)
Description:
Q9Y233
Residue:
1055
  
Inhibitor
Name:
BDBM97523
Synonyms:
Roche-Dataset for PDE10A, Compound 107 | US8470820, 34
Type:
Small organic molecule
Emp. Form.:
C22H22N8O2
Mol. Mass.:
430.4625
SMILES:
CCc1ccc(Nc2cncnc2)c(n1)C(=O)Nc1cc(nn1CCO)-c1ccccn1
: