Target
cGMP-dependent 3',5'-cyclic phosphodiesterase
Ligand
BDBM50425143
Substrate
Meas. Tech.
Proximity Ligation Assay
IC50
0.290±n/a nM
Citation
 Aronsen, JMSkogestad, J Treatment of tachycardia US Patent  US11419874 Publication Date 8/23/2022 
Target
Name:
cGMP-dependent 3',5'-cyclic phosphodiesterase
Synonyms:
CGS-PDE Homo sapiens phosphodiesterase 2A (PDE2A) PDE2A cGSPDE
Type:
Enzyme Catalytic Domain
Mol. Mass.:
105691.58
Organism:
Homo sapiens (Human)
Description:
O00408
Residue:
941
  
Inhibitor
Name:
BDBM50425143
Synonyms:
CHEMBL2313247 | US11419874, Example 11
Type:
Small organic molecule
Emp. Form.:
C19H16ClN5O
Mol. Mass.:
365.816
SMILES:
CCNC(=O)c1ccc2nc(C)c3nnc(-c4ccccc4Cl)n3c2c1
: