Target
Mast/stem cell growth factor receptor Kit [D816V]
Ligand
BDBM175658
Substrate
Meas. Tech.
Kit Wild Type Assay
pH
7.5±n/a
Temperature
298.15±n/a K
IC50
5.50±n/a nM
Comments
extracted
Citation
 Hodous, BL Compositions useful for treating disorders related to kit US Patent  US9688680 Publication Date 6/27/2017 
Target
Name:
Mast/stem cell growth factor receptor Kit [D816V]
Synonyms:
KIT Mast/stem cell growth factor receptor Kit (D816V) SCFR | Tyrosine-protein kinase Kit (Kit)(D816V)
Type:
Protein
Mol. Mass.:
109854.42
Organism:
Homo sapiens (Human)
Description:
Human Kit D816V mutant
Residue:
976
  
Inhibitor
Name:
BDBM175658
Synonyms:
US9688680, 205
Type:
Small organic molecule
Emp. Form.:
C24H26ClN7O2
Mol. Mass.:
479.962
SMILES:
CC[C@H](NC(=O)C1CN(C1)c1ncnn2cc(cc12)-c1cnn(CCO)c1)c1ccc(Cl)cc1
: