Target
Cyclin-dependent kinase 9
Ligand
BDBM307722
Substrate
Meas. Tech.
TR-FRET Kinase Assay
IC50
13.0±n/a nM
Citation
 Mastracchio, ABruncko, MLai, CMiyashiro, JMTao, ZWoods, KWPenning, TDSouers, AJ Pyridine CDK9 kinase inhibitors US Patent  US9650358 Publication Date 5/16/2017 
Target
Name:
Cyclin-dependent kinase 9
Synonyms:
C-2K CDK9 Cell division cycle 2-like protein kinase 4 Cyclin-Dependent Kinase 9 (CDK9) Serine/threonine-protein kinase PITALRE Tat-associated kinase complex catalytic subunit
Type:
Enzyme Subunit
Mol. Mass.:
42789.13
Organism:
Homo sapiens (Human)
Description:
Residue:
372
  
Inhibitor
Name:
BDBM307722
Synonyms:
(3R)-N-(5-chloro-4-{1-[2-(3-fluorophenyl)ethyl]-1H-benzimidazol-6-yl}pyridin-2-yl)piperidine-3-carboxamide | US9650358, Example 18
Type:
Small organic molecule
Emp. Form.:
C26H25ClFN5O
Mol. Mass.:
477.961
SMILES:
Fc1cccc(CCn2cnc3ccc(cc23)-c2cc(NC(=O)[C@@H]3CCCNC3)ncc2Cl)c1
: