Target
Cyclin-dependent kinase 9
Ligand
BDBM307759
Substrate
Meas. Tech.
TR-FRET Kinase Assay
IC50
36.0±n/a nM
Citation
 Mastracchio, ABruncko, MLai, CMiyashiro, JMTao, ZWoods, KWPenning, TDSouers, AJ Pyridine CDK9 kinase inhibitors US Patent  US9650358 Publication Date 5/16/2017 
Target
Name:
Cyclin-dependent kinase 9
Synonyms:
C-2K CDK9 Cell division cycle 2-like protein kinase 4 Cyclin-Dependent Kinase 9 (CDK9) Serine/threonine-protein kinase PITALRE Tat-associated kinase complex catalytic subunit
Type:
Enzyme Subunit
Mol. Mass.:
42789.13
Organism:
Homo sapiens (Human)
Description:
Residue:
372
  
Inhibitor
Name:
BDBM307759
Synonyms:
N′-{5-chloro-4-[1-(3-fluorobenzyl)-1H-benzimidazol-6-yl]pyridin-2-yl}-N,N-dimethylbutane-1,4-diamine | US9650358, Example 55
Type:
Small organic molecule
Emp. Form.:
C25H27ClFN5
Mol. Mass.:
451.967
SMILES:
CN(C)CCCCNc1cc(c(Cl)cn1)-c1ccc2ncn(Cc3cccc(F)c3)c2c1
: