Target
Cyclin-dependent kinase 9
Ligand
BDBM307908
Substrate
Meas. Tech.
TR-FRET Kinase Assay
IC50
16.0±n/a nM
Citation
 Mastracchio, ABruncko, MLai, CMiyashiro, JMTao, ZWoods, KWPenning, TDSouers, AJ Pyridine CDK9 kinase inhibitors US Patent  US9650358 Publication Date 5/16/2017 
Target
Name:
Cyclin-dependent kinase 9
Synonyms:
C-2K CDK9 Cell division cycle 2-like protein kinase 4 Cyclin-Dependent Kinase 9 (CDK9) Serine/threonine-protein kinase PITALRE Tat-associated kinase complex catalytic subunit
Type:
Enzyme Subunit
Mol. Mass.:
42789.13
Organism:
Homo sapiens (Human)
Description:
Residue:
372
  
Inhibitor
Name:
BDBM307908
Synonyms:
N-{5-chloro-4-[1-(3-fluorobenzyl)-1H-benzimidazol-6-yl]pyridin-2-yl}-2-oxohexahydro-2H-cyclopenta[d][1,3]oxazole-5-carboxamide | US9650358, Example 204
Type:
Small organic molecule
Emp. Form.:
C26H21ClFN5O3
Mol. Mass.:
505.928
SMILES:
Fc1cccc(Cn2cnc3ccc(cc23)-c2cc(NC(=O)C3CC4NC(=O)OC4C3)ncc2Cl)c1
: