Target
Cyclin-dependent kinase 9
Ligand
BDBM307916
Substrate
Meas. Tech.
TR-FRET Kinase Assay
IC50
14.0±n/a nM
Citation
 Mastracchio, ABruncko, MLai, CMiyashiro, JMTao, ZWoods, KWPenning, TDSouers, AJ Pyridine CDK9 kinase inhibitors US Patent  US9650358 Publication Date 5/16/2017 
Target
Name:
Cyclin-dependent kinase 9
Synonyms:
C-2K CDK9 Cell division cycle 2-like protein kinase 4 Cyclin-Dependent Kinase 9 (CDK9) Serine/threonine-protein kinase PITALRE Tat-associated kinase complex catalytic subunit
Type:
Enzyme Subunit
Mol. Mass.:
42789.13
Organism:
Homo sapiens (Human)
Description:
Residue:
372
  
Inhibitor
Name:
BDBM307916
Synonyms:
(2s,4r)-tert-butyl 2-(5-chloro-4-(1-(3-fluorobenzyl)-1H-benzo[d]imidazol-6-yl)pyridin-2-ylamino)-6-azaspiro[3.4]octane-6-carboxylate | US9650358, Example 212
Type:
Small organic molecule
Emp. Form.:
C31H33ClFN5O2
Mol. Mass.:
562.077
SMILES:
CC(C)(C)OC(=O)N1CCC2(CC(C2)Nc2cc(c(Cl)cn2)-c2ccc3ncn(Cc4cccc(F)c4)c3c2)C1
: