Target
Activin receptor type-1 [147-509]
Ligand
BDBM575133
Substrate
Meas. Tech.
ALK2 HTRF Assay
IC50
<1±n/a nM
Citation
 Pan, JRoach, JMei, SHe, CWu, LYao, W Imidazopyridazine and imidazopyridine compounds and uses thereof US Patent  US11459329 Publication Date 10/4/2022 
Target
Name:
Activin receptor type-1 [147-509]
Synonyms:
ACVR1 ACVRLK2 | Activin receptor-like kinase 2 (ALK-2) (aa 147-509)
Type:
Enzyme Catalytic Domain
Mol. Mass.:
41331.39
Organism:
Homo sapiens (Human)
Description:
aa147-end
Residue:
363
  
Inhibitor
Name:
BDBM575133
Synonyms:
US11459329, Example 7
Type:
Small organic molecule
Emp. Form.:
C26H24N6O
Mol. Mass.:
436.5084
SMILES:
OCc1nn2c(cnc2cc1-c1ccc(cc1)N1CCNCC1)-c1ccnc2ccccc12
: