Target
Activin receptor type-1 [147-509]
Ligand
BDBM575163
Substrate
Meas. Tech.
ALK2 HTRF Assay
IC50
<1±n/a nM
Citation
 Pan, JRoach, JMei, SHe, CWu, LYao, W Imidazopyridazine and imidazopyridine compounds and uses thereof US Patent  US11459329 Publication Date 10/4/2022 
Target
Name:
Activin receptor type-1 [147-509]
Synonyms:
ACVR1 ACVRLK2 | Activin receptor-like kinase 2 (ALK-2) (aa 147-509)
Type:
Enzyme Catalytic Domain
Mol. Mass.:
41331.39
Organism:
Homo sapiens (Human)
Description:
aa147-end
Residue:
363
  
Inhibitor
Name:
BDBM575163
Synonyms:
US11459329, Example 37
Type:
Small organic molecule
Emp. Form.:
C29H26N8O
Mol. Mass.:
502.5697
SMILES:
Cc1nn2c(cnc2cc1-c1cnn(c1)[C@H]1CC[C@H](O)CC1)-c1ccnc2nc(ccc12)-c1ccccn1
: