Target
P2X purinoceptor 7
Ligand
BDBM173660
Substrate
Meas. Tech.
In Vitro Assay
IC50
2.30±n/a nM
Citation
 Kilburn, JPRasmussen, LKJessing, MEldemenky, EMChen, BJiang, YHopper, AT Benzamide-containing compounds and their use in the treatment of pain US Patent  US9649308 Publication Date 5/16/2017 
Target
Name:
P2X purinoceptor 7
Synonyms:
ATP receptor P2RX7_HUMAN P2X purinoceptor 7 (P2X7) P2Z receptor | Purinergic receptor
Type:
Protein
Mol. Mass.:
68602.85
Organism:
Homo sapiens (Human)
Description:
Q99572
Residue:
595
  
Inhibitor
Name:
BDBM173660
Synonyms:
US9102591, 2,5-dichloro-N-((4,4-difluoro-1-(6-fluoropyridin-3-yl)cyclohexyl)methyl)benzamide | US9649308, 2,5-dichloro-N-((4,4-difluoro-1-(6-fluoropyridin-3-yl)cyclohexyl)methyl)benzamide
Type:
Small organic molecule
Emp. Form.:
C19H17Cl2F3N2O
Mol. Mass.:
417.252
SMILES:
Fc1ccc(cn1)C1(CNC(=O)c2cc(Cl)ccc2Cl)CCC(F)(F)CC1
: