Target
P2X purinoceptor 7
Ligand
BDBM173687
Substrate
Meas. Tech.
In Vitro Assay
IC50
1.50±n/a nM
Citation
 Kilburn, JPRasmussen, LKJessing, MEldemenky, EMChen, BJiang, YHopper, AT Benzamide-containing compounds and their use in the treatment of pain US Patent  US9649308 Publication Date 5/16/2017 
Target
Name:
P2X purinoceptor 7
Synonyms:
ATP receptor P2RX7_HUMAN P2X purinoceptor 7 (P2X7) P2Z receptor | Purinergic receptor
Type:
Protein
Mol. Mass.:
68602.85
Organism:
Homo sapiens (Human)
Description:
Q99572
Residue:
595
  
Inhibitor
Name:
BDBM173687
Synonyms:
US9102591, (+)2,3-dichloro-N-[2-(2-methylpyrimidin-5-yl)-3-[1-(trifluoromethyl)cyclopropyl]propyl]benzamide US9102591, 2,3-dichloro-N-[2-(2-methylpyrimidin-5-yl)-3-[1-(trifluoromethyl)cyclopropyl]propyl]benzamide | US9649308, (+)2,3-dichloro-N-[2-(2-methylpyrimidin-5-yl)-3-[1-(trifluoromethyl)cyclopropyl]propyl]benzamide
Type:
Small organic molecule
Emp. Form.:
C19H18Cl2F3N3O
Mol. Mass.:
432.267
SMILES:
Cc1ncc(cn1)C(CNC(=O)c1cccc(Cl)c1Cl)CC1(CC1)C(F)(F)F
: