Target
P2X purinoceptor 7
Ligand
BDBM173724
Substrate
Meas. Tech.
In Vitro Assay
IC50
2.90±n/a nM
Citation
 Kilburn, JPRasmussen, LKJessing, MEldemenky, EMChen, BJiang, YHopper, AT Benzamide-containing compounds and their use in the treatment of pain US Patent  US9649308 Publication Date 5/16/2017 
Target
Name:
P2X purinoceptor 7
Synonyms:
ATP receptor P2RX7_HUMAN P2X purinoceptor 7 (P2X7) P2Z receptor | Purinergic receptor
Type:
Protein
Mol. Mass.:
68602.85
Organism:
Homo sapiens (Human)
Description:
Q99572
Residue:
595
  
Inhibitor
Name:
BDBM173724
Synonyms:
US9102591, (+)2-chloro-N-[3-cyclopropyl-2-[6-(trifluoromethyl)-3-pyridyl]propyl]-3-fluoro-benzamide US9649308, 2(-)-chloro-N-[3-cyclopropyl-2-[6-(trifluoromethyl)-3-pyridyl]propyl]-3-fluoro-benzamide
Type:
Small organic molecule
Emp. Form.:
C19H17ClF4N2O
Mol. Mass.:
400.798
SMILES:
Fc1cccc(C(=O)NCC(CC2CC2)c2ccc(nc2)C(F)(F)F)c1Cl
: