Target
P2X purinoceptor 7
Ligand
BDBM173735
Substrate
Meas. Tech.
In Vitro Assay
IC50
3.20±n/a nM
Citation
 Kilburn, JPRasmussen, LKJessing, MEldemenky, EMChen, BJiang, YHopper, AT Benzamide-containing compounds and their use in the treatment of pain US Patent  US9649308 Publication Date 5/16/2017 
Target
Name:
P2X purinoceptor 7
Synonyms:
ATP receptor P2RX7_HUMAN P2X purinoceptor 7 (P2X7) P2Z receptor | Purinergic receptor
Type:
Protein
Mol. Mass.:
68602.85
Organism:
Homo sapiens (Human)
Description:
Q99572
Residue:
595
  
Inhibitor
Name:
BDBM173735
Synonyms:
US9102591, 3-chloro-N-((4,4-difluoro-1-(6-(trifluoromethyl)pyridin-3-yl)cyclohexyl)methyl)-2-fluorobenzamide | US9649308, 3-chloro-N-((4,4-difluoro-1-(6-(trifluoromethyl)pyridin-3-yl)cyclohexyl)methyl)-2-fluorobenzamide
Type:
Small organic molecule
Emp. Form.:
C20H17ClF6N2O
Mol. Mass.:
450.805
SMILES:
Fc1c(Cl)cccc1C(=O)NCC1(CCC(F)(F)CC1)c1ccc(nc1)C(F)(F)F
: