Target
P2X purinoceptor 7
Ligand
BDBM173753
Substrate
Meas. Tech.
In Vitro Assay
IC50
0.82±n/a nM
Citation
 Kilburn, JPRasmussen, LKJessing, MEldemenky, EMChen, BJiang, YHopper, AT Benzamide-containing compounds and their use in the treatment of pain US Patent  US9649308 Publication Date 5/16/2017 
Target
Name:
P2X purinoceptor 7
Synonyms:
ATP receptor P2RX7_HUMAN P2X purinoceptor 7 (P2X7) P2Z receptor | Purinergic receptor
Type:
Protein
Mol. Mass.:
68602.85
Organism:
Homo sapiens (Human)
Description:
Q99572
Residue:
595
  
Inhibitor
Name:
BDBM173753
Synonyms:
US9102591, (+)2,6-dichloro-N-[3-cyclopropyl-2-[2-(trifluoromethyl)pyrimidin-5-yl]propyl]benzamide US9102591, 2,6-dichloro-N-(3-cyclopropyl-2-(2-(trifluoromethyl)pyrimidin-5-yl)propyl)benzamide | US9649308, (+)2,6-dichloro-N-[3-cyclopropyl-2-[2-(trifluoromethyl)pyrimidin-5-yl]propyl]benzamide
Type:
Small organic molecule
Emp. Form.:
C18H16Cl2F3N3O
Mol. Mass.:
418.24
SMILES:
FC(F)(F)c1ncc(cn1)C(CNC(=O)c1c(Cl)cccc1Cl)CC1CC1
: