Target
P2X purinoceptor 7
Ligand
BDBM173775
Substrate
Meas. Tech.
In Vitro Assay
IC50
0.95±n/a nM
Citation
 Kilburn, JPRasmussen, LKJessing, MEldemenky, EMChen, BJiang, YHopper, AT Benzamide-containing compounds and their use in the treatment of pain US Patent  US9649308 Publication Date 5/16/2017 
Target
Name:
P2X purinoceptor 7
Synonyms:
ATP receptor P2RX7_HUMAN P2X purinoceptor 7 (P2X7) P2Z receptor | Purinergic receptor
Type:
Protein
Mol. Mass.:
68602.85
Organism:
Homo sapiens (Human)
Description:
Q99572
Residue:
595
  
Inhibitor
Name:
BDBM173775
Synonyms:
US9102591, 2,3-dichloro-N-[[4,4-difluoro-1-[2-(trifluoromethyl)pyrimidin-5-yl]cyclohexyl]methyl]benzamide | US9649308, 2,3-dichloro-N-[[4,4-difluoro-1-[2-(trifluoromethyl)pyrimidin-5-yl]cyclohexyl]methyl]benzamide
Type:
Small organic molecule
Emp. Form.:
C19H16Cl2F5N3O
Mol. Mass.:
468.248
SMILES:
FC(F)(F)c1ncc(cn1)C1(CNC(=O)c2cccc(Cl)c2Cl)CCC(F)(F)CC1
: