Target
P2X purinoceptor 7
Ligand
BDBM173828
Substrate
Meas. Tech.
In Vitro Assay
IC50
2.00±n/a nM
Citation
 Kilburn, JPRasmussen, LKJessing, MEldemenky, EMChen, BJiang, YHopper, AT Benzamide-containing compounds and their use in the treatment of pain US Patent  US9649308 Publication Date 5/16/2017 
Target
Name:
P2X purinoceptor 7
Synonyms:
ATP receptor P2RX7_HUMAN P2X purinoceptor 7 (P2X7) P2Z receptor | Purinergic receptor
Type:
Protein
Mol. Mass.:
68602.85
Organism:
Homo sapiens (Human)
Description:
Q99572
Residue:
595
  
Inhibitor
Name:
BDBM173828
Synonyms:
US9102591, (+)2-chloro-N-[2-(4-fluorophenyl)-2-[2-(trifluoromethyl)pyrimidin-5-yl]ethyl]benzamide US9649308, (-)2-chloro-N-[2-(4-fluorophenyl)-2-[2-(trifluoromethyl)pyrimidin-5-yl]ethyl]benzamide
Type:
Small organic molecule
Emp. Form.:
C20H14ClF4N3O
Mol. Mass.:
423.791
SMILES:
Fc1ccc(cc1)C(CNC(=O)c1ccccc1Cl)c1cnc(nc1)C(F)(F)F
: