Target
cAMP-specific 3',5'-cyclic phosphodiesterase 4B
Ligand
BDBM175796
Substrate
Meas. Tech.
cAMP HRTF Assay
pH
7.8±n/a
Temperature
298.15±n/a K
IC50
5500±n/a nM
Comments
extracted
Citation
 Jauhiainen, MJakob, FKonetzki, IYuan, WGelb, MHCraan, TDolphin, PJNardi, AHesslinger, C Substituted condensed pyrimidine compounds US Patent  US9688683 Publication Date 6/27/2017 
Target
Name:
cAMP-specific 3',5'-cyclic phosphodiesterase 4B
Synonyms:
3',5'-cyclic phosphodiesterase Isoform PDE4B1 PDE4B PDE4B_HUMAN Phosphodiesterase 4B (PDE4B) Phosphodiesterase Type 4 (PDE4B)
Type:
Protein
Mol. Mass.:
83318.87
Organism:
Homo sapiens (Human)
Description:
Q07343
Residue:
736
  
Inhibitor
Name:
BDBM175796
Synonyms:
US9688683, 77
Type:
Small organic molecule
Emp. Form.:
C23H23N5O3
Mol. Mass.:
417.4604
SMILES:
CCc1nc(nc2n(ccc12)-c1cccc(OC(=O)N(C)C)c1)-c1cnccc1OC
: