Target
Receptor-type tyrosine-protein kinase FLT3
Ligand
BDBM308304
Substrate
Meas. Tech.
Activity Assay
IC50
2.00±n/a nM
Citation
 Wang, XZhang, WFrye, S Therapeutic uses of selected pyrimidine compounds with anti-Mer tyrosine kinase activity US Patent  US9649309 Publication Date 5/16/2017 
Target
Name:
Receptor-type tyrosine-protein kinase FLT3
Synonyms:
CD135 FL cytokine receptor FLK2 FLT3 Fetal liver kinase-2 Fms-like tyrosine kinase 3 (Flt-3) STK-1 Stem cell tyrosine kinase 1
Type:
Enzyme
Mol. Mass.:
112888.62
Organism:
Homo sapiens (Human)
Description:
P36888
Residue:
993
  
Inhibitor
Name:
BDBM308304
Synonyms:
US9649309, Compound UNC3203A
Type:
Small organic molecule
Emp. Form.:
C23H23N5O
Mol. Mass.:
385.4616
SMILES:
O[C@H]1CCC(CC1)Nc1nc(Nc2ccc(cc2)C#C)ncc1-c1ccccn1
: