Target
Tyrosine-protein kinase receptor TYRO3
Ligand
BDBM308304
Substrate
Meas. Tech.
Activity Assay
IC50
39.0±n/a nM
Citation
 Wang, XZhang, WFrye, S Therapeutic uses of selected pyrimidine compounds with anti-Mer tyrosine kinase activity US Patent  US9649309 Publication Date 5/16/2017 
Target
Name:
Tyrosine-protein kinase receptor TYRO3
Synonyms:
BYK RSE TIF TYRO3_HUMAN | Tyrosine-protein kinase SKY
Type:
Protein
Mol. Mass.:
96894.13
Organism:
Homo sapiens (Human)
Description:
Q06418
Residue:
890
  
Inhibitor
Name:
BDBM308304
Synonyms:
US9649309, Compound UNC3203A
Type:
Small organic molecule
Emp. Form.:
C23H23N5O
Mol. Mass.:
385.4616
SMILES:
O[C@H]1CCC(CC1)Nc1nc(Nc2ccc(cc2)C#C)ncc1-c1ccccn1
: