Target
Non-receptor tyrosine-protein kinase TYK2
Ligand
BDBM305831
Substrate
Meas. Tech.
JAK Caliper Enzyme Assay at 1 mM ATP
IC50
7.00±n/a nM
Citation
 Brown, MFDermenci, AFensome, AGerstenberger, BSHayward, MMOwen, DRWright, SWXing, LHYang, X Pyrazolo[1,5-a]pyrazin-4-yl derivatives US Patent  US11472809 Publication Date 10/18/2022 
Target
Name:
Non-receptor tyrosine-protein kinase TYK2
Synonyms:
Non-receptor tyrosine-protein kinase TYK2 (TYK2) TYK2_HUMAN | Tyrosine-protein kinase TYK2
Type:
Protein
Mol. Mass.:
133666.03
Organism:
Homo sapiens (Human)
Description:
P29597
Residue:
1187
  
Inhibitor
Name:
BDBM305831
Synonyms:
2-((1r,3s)-1-(4-(6-(3-Amino-1H-pyrazol-5-yl)pyrazolo[1,5-a]pyrazin-4-yl)-1H-pyrazol-1-yl)-3-methoxycyclobutyl)acetonitrile US10822341, Example 30 | US11472809, Example 30
Type:
Small organic molecule
Emp. Form.:
C19H19N9O
Mol. Mass.:
389.4139
SMILES:
CO[C@H]1C[C@@](CC#N)(C1)n1cc(cn1)-c1nc(cn2nccc12)-c1cc(N)[nH]n1
: